{"text_format":"3","workbook":"xlsx","n_sheets":9,"sheets":["Anleitung","Metadaten","Übersicht","Projektstruktur","Risiken","Maßnahmen","Risikoberechnung","Listen","Prozess-Template"],"not_rendered":{"images":1,"defined_names":25},"read":"whole","date_system":"1900"}

{"sheet":"Anleitung","index":0,"n_rows":45,"n_cols":8,"rows_kept":45,"merged":[[0,1,4,5],[5,0,8,5],[9,0,11,5],[12,0,12,5],[14,0,14,5],[14,7,14,10],[15,0,15,5],[16,0,16,5],[17,0,17,5],[18,0,18,5],[19,0,19,5],[20,0,20,5],[21,0,21,5],[22,0,22,5],[23,0,23,5],[24,0,24,5],[25,0,25,5],[26,0,26,5],[27,0,27,5],[28,0,28,5],[29,0,29,5],[31,0,31,5],[32,0,32,1],[32,2,32,5],[33,0,33,1],[33,2,33,5],[34,0,34,1],[34,2,34,5],[35,0,35,1],[35,2,35,5],[36,0,36,1],[36,2,36,5],[37,0,37,1],[37,2,37,5],[38,0,38,1],[38,2,38,5],[41,1,41,5],[42,1,42,5],[43,1,43,5],[44,1,45,5]]}
[null,"Vorlage zur Dokumentation einer Datenschutz-Folgenabschätzung nach Art. 35 DSGVO\nVersion 0.12"]
[]
[]
[]
[]
["Sie haben festgestellt, dass für ihr Projekt, Forschungsvorhaben, o.ä. eine DSFA notwendig ist?\nMit dieser Vorlage können Sie die DSFA durchführen. \nSollten die vorausgefüllten Risiken und Maßnahmen nicht ihren Bedürfnissen entsprechen, können Sie Vorlage auch ergänzen."]
[]
[]
[]
["- Es wird Microsoft Excel oder LibreOffice Version >= 24.8.1 benötigt damit alle Funktionen verfügbar sind.\n- Bei Fragen zur Verwendung, Funktion und insbesondere bei Fehlern in der Vorlage: fabian.stegmaier@ruhr-uni-bochum.de"]
[]
[]
["Diese Vorlage wurde auf Grundlage des \"Template zur Dokumentation von Datenschutz-Folgenabschätzungen nach Art. 35 DSGVO\" des TMF in Version 1.01 erstellt. "]
[]
["Vorgehensweise bei der Erstellung Ihrer Risiko- und Schutzbedarfsanalyse:",{"$nulls":6},"Schematische Prozessdarstellung"]
["1. Bitte geben Sie die Metadaten ein und beschreiben Sie Ihre Projektstruktur im jeweiligen Tabellenblatt. "]
["2. Bitte prüfen Sie die Risiken- und Maßnahmenvorschläge in den Tabellenblättern Risiken und Maßnahmen und ergänzen Sie diese bei Bedarf (siehe Beschreibungen zu Risiken und Maßnahmen)."]
["3. Kopieren Sie nun bitte das Prozess-Template und benennen Sie es spezifisch. Da jedes Projekt typischerweise mehrere Stellen oder Bereiche umfasst und diesen jeweils mehrere Prozesse und diesen wiederum mehrere Gefährdungen zugeordnet sein können, werden Sie viele Tabellenblätter erzeugen. Legen Sie sich deshalb ein Benennungssystem mit Kürzeln oder Nummern für jede Stelle bzw. jeden Bereich sowie jeden Prozess zu. Wenn Sie je Prozess aufgrund vielfältiger Gefährdungen mehrere Arbeitsblätter benötigen, fügen Sie den Namen der Arbeitsblätter jeweils am Ende eine fortlaufende Zahl an."]
["4. Bearbeiten Sie die korrekt benannte Kopie des Prozess-Templates."]
["Wählen Sie zuerst die betroffene Stelle oder den betroffenen Bereich mit Hilfe des Dropdown-Menüs aus."]
{"$rows_left_out":26}
{"sheet":"Metadaten","index":1,"n_rows":9,"n_cols":1,"rows_kept":9}
["Metadaten"]
["Projekt(name):"]
["Status:"]
["Version:"]
["vom:"]
["AutorInnen:"]
["Kommentare/Historie:"]
["Stellungnahme der Betroffenen:"]
["Stellungnahme der/des Datenschutzbeauftragten:"]

{"sheet":"Übersicht","index":2,"n_rows":104,"n_cols":7,"rows_kept":104,"merged":[[0,0,1,3],[0,6,2,6],[2,0,2,3],[2,4,2,5]]}
[{"$f":" \"Übersicht zur Risikoanalyse im Projekt: \" & Metadaten!$B$2","v":"Übersicht zur Risikoanalyse im Projekt: "},{"$nulls":3},"Version:",{"$f":"Metadaten!B4","v":0},"Farbcode:  Beige Felder sind ausfüllbar (Spalte A)"]
[{"$nulls":4},"Datum:",{"$f":"Metadaten!B5","v":"00:00:00"}]
["Bitte in Spalte A ab Zeile 5 die Namen der Tabellenblätter mit der Risikoanalyse je Prozessschritt eingeben. "]
["Tabellenblatt",{"$f":"Strukturkategorie","v":0},"Prozessschritt","Gefährdung(en)","Risiko vor Maßnahmen","Risiko nach Maßnahmen","Link zum Tabellenblatt"]
[null,{"$f":"IF(ISTEXT(A5),INDIRECT(CONCATENATE(\"'\", A5,\"'!a4\")),\"\")","v":""},{"$f":"IF(ISTEXT(A5),INDIRECT(CONCATENATE(\"'\", A5,\"'!a6\")),\"\")","v":""},{"$f":"IF(ISTEXT(INDIRECT(CONCATENATE(\"'\", A5,\"'!a8\"))),INDIRECT(CONCATENATE(\"'\", A5,\"'!a8\")),\"\") &\nIF(ISTEXT(INDIRECT(CONCATENATE(\"'\", A5,\"'!a9\"))), CHAR(10) & INDIRECT(CONCATENATE(\"'\", A5,\"'!a9\")),\"\") &\nIF(ISTEXT(INDIRECT(CONCATENATE(\"'\", A5,\"'!a10\"))),CHAR(10) & INDIRECT(CONCATENATE(\"'\", A5,\"'!a10\")),\"\")","v":""},{"$f":"IF(ISTEXT(A5),INDIRECT(CONCATENATE(\"'\", $A5,\"'!d9\")),\"\")","v":""},{"$f":"IF(ISTEXT($A5),INDIRECT(CONCATENATE(\"'\", $A5,\"'!e9\")),\"\")","v":""},{"$f":"IF(ISTEXT(A5),HYPERLINK(\"#'\" & A5 & \"'!a1\",\"Link\"),\"\")","v":""}]
[null,{"$f":"IF(ISTEXT(A6),INDIRECT(CONCATENATE(\"'\", A6,\"'!a4\")),\"\")","v":""},{"$f":"IF(ISTEXT(A6),INDIRECT(CONCATENATE(\"'\", A6,\"'!a6\")),\"\")","v":""},{"$f":"IF(ISTEXT(INDIRECT(CONCATENATE(\"'\", A6,\"'!a8\"))),INDIRECT(CONCATENATE(\"'\", A6,\"'!a8\")),\"\") &\nIF(ISTEXT(INDIRECT(CONCATENATE(\"'\", A6,\"'!a9\"))), CHAR(10) & INDIRECT(CONCATENATE(\"'\", A6,\"'!a9\")),\"\") &\nIF(ISTEXT(INDIRECT(CONCATENATE(\"'\", A6,\"'!a10\"))),CHAR(10) & INDIRECT(CONCATENATE(\"'\", A6,\"'!a10\")),\"\")","v":""},{"$f":"IF(ISTEXT(A6),INDIRECT(CONCATENATE(\"'\", $A6,\"'!d9\")),\"\")","v":""},{"$f":"IF(ISTEXT($A6),INDIRECT(CONCATENATE(\"'\", $A6,\"'!e9\")),\"\")","v":""},{"$f":"IF(ISTEXT(A6),HYPERLINK(\"#'\" & A6 & \"'!a1\",\"Link\"),\"\")","v":""}]
[null,"","","","","",""]
[null,"","","","","",""]
[null,"","","","","",""]
[null,"","","","","",""]
[null,"","","","","",""]
[null,"","","","","",""]
[null,"","","","","",""]
[null,"","","","","",""]
[null,"","","","","",""]
[null,"","","","","",""]
[null,"","","","","",""]
[null,"","","","","",""]
[null,"","","","","",""]
[null,"","","","","",""]
{"$rows_left_out":85}
{"sheet":"Projektstruktur","index":3,"n_rows":1,"n_cols":6,"rows_kept":1,"merged":[[0,1,0,3]]}
["Projektstruktur","Geben Sie hier an, welcher Strukturkategorie die Überschriften in dieser Tabelle entsprechen (z.B. beteiligte Stelle, Standort, Projektphase, Bereich o.ä.): \nDie Tabelleneinträge entsprechend dann den jeweils zugeordneten Prozessen.",{"$nulls":3},"Farbcode: Farbige Felder sind ausfüllbar"]

{"sheet":"Risiken","index":4,"n_rows":117,"n_cols":4,"rows_kept":117,"merged":[[0,0,0,2],[0,3,1,4],[2,3,3,5]]}
["Risikobeispiele nach betroffener Gefährdung und Risikoquelle\nPassen Sie diese Liste nach eigenen Bedarfen in Ihrem Projekt an oder ergänzen Sie diese.",null,null,"Farbcode:   Beige Felder sind ausfüllbar"]
["Gefährdung","Risikoquelle","Beispiel"]
["Einschränkung des Auskunftsrechts","interne menschliche Quellen","Ansprechperson in der verantwortlichen Stelle für betroffene Person temporär nicht verfügbar","Hinweis:\nSie können am Ende der Liste eigene Risikoquellen eintragen, diese werden im Prozess-Template angezeigt."]
["Einschränkung des Auskunftsrechts","interne menschliche Quellen","Passwort für Zugang zu personenbezogenen Daten durch autorisierte Person nicht verfügbar"]
["Einschränkung des Auskunftsrechts","interne menschliche Quellen","Temporärer Verlust von personenbezogenen Daten während privater Lagerung mobiler Speichermedien"]
["Einschränkung des Auskunftsrechts","interne menschliche Quellen","Berechtigung zur Herausgabe der personenbezogenen Daten liegt nicht vor"]
["Einschränkung des Auskunftsrechts","externe menschliche Quellen","Sperrung des Zugangs zu personenbezogenen Daten  durch manuelle Veränderung des Passworts zum geschützen Bereich"]
["Einschränkung des Auskunftsrechts","externe menschliche Quellen","Externe Stelle, die für die das Auskunftsrecht benötigt wird, kommt den entsprechenden Pflichten nicht nach (z.B. liefert nicht angeforderte Informationen)"]
["Einschränkung des Auskunftsrechts","nicht-menschliche Quellen","Fehlerhafte/Unzureichende Protokollierung der Übermittelung von personenbezogenen Daten zwischen Institutionen/Stellen"]
["Einschränkung des Auskunftsrechts","nicht-menschliche Quellen","Fehlerhaftes Record Linkage führt zu keinem oder falschverknüpften Datensatz beim Auskunftsgesuch "]
["Einschränkung des Auskunftsrechts","nicht-menschliche Quellen","Stromausfall verhindert Zugang zu personenbezogenen Daten"]
["Einschränkung des Auskunftsrechts","nicht-menschliche Quellen","Speicherschaden verhindert temporär Zugang zu personenbezogenen Daten"]
["Einschränkung des Auskunftsrechts","nicht-menschliche Quellen","Sperrung des Zugangs zu personenbezogenen Daten durch Veränderung des Passworts zum geschützen Bereichs (Erbeutung des Passworts durch z.B. Phishing, Brute-Force-Angriff)"]
["Einschränkung des Auskunftsrechts","nicht-menschliche Quellen","DoS-Angriff auf IT-Infrastruktur: Außerbetriebsetzung von Servern durch Anfragebombardement"]
["Einschränkung des Auskunftsrechts","nicht-menschliche Quellen","Ausfall von IT-Systemen bedingt durch z.B. Stromausfall, höhere Gewalt etc."]
["Einschränkung des Auskunftsrechts","nicht-menschliche Quellen","Verhinderung des Zugriffs auf personenbezogene Daten durch Ransomware "]
["Einschränkung des Berichtigungsrechts","interne menschliche Quellen","Passwort für Zugang zu personenbezogenen Daten durch autorisierte Person nicht verfügbar"]
["Einschränkung des Berichtigungsrechts","interne menschliche Quellen","Ansprechperson in der verantwortlichen Stelle für betroffene Person temporär nicht verfügbar"]
["Einschränkung des Berichtigungsrechts","interne menschliche Quellen","Temporärer Verlust von personenbezogenen Daten während privater Lagerung mobiler Speichermedien"]
["Einschränkung des Berichtigungsrechts","externe menschliche Quellen","Datenverarbeitende Stelle meldet nicht oder nicht im erfoderlichen Umfang relevante Vorfälle  an verantwortliche Stelle für betroffene Person"]
{"$rows_left_out":98}
{"sheet":"Maßnahmen","index":5,"n_rows":131,"n_cols":4,"rows_kept":131,"merged":[[0,0,0,1],[2,3,3,5]]}
["Liste der Technischen und Organisatorischen Maßnahmen\nBitte passen Sie diese hier beispielhaft aufgeführten Maßnahmen an die technischen und organisatorischen Maßnahmen zum Schutz der Daten\nin Ihrem konkreten Projekt an. In Spalte C können Sie Verweise auf ausführlichere Beschreibungen in Ihrem Datenschutzkonzept oder Verträge etc. hinterlegen.",null,"Farbcode:   Beige Felder sind ausfüllbar"]
["Bezeichnung","Beschreibung","Nr./ID/Kap."]
["Zutrittskontrolle: Ausschließliche Nutzung der zentralen Netzinfrastruktur der RUB","Netzkomponenten befinden sich in verschlossenen Schränken oder verschlossenen Räumen. (R  5.4.1); Zugang zu Netzkomponenten ist auf Berechtigte (zentraler Betreiber) eingeschränkt. (R 5.4.1); Öffentlich zugängliche Netzzugänge (Netzwerkdose, WLAN) erfordern eine Validierung.  ","RUB-TOMs 3.1","Hinweis:\nSie können am Ende der Liste eigene Maßnahmen eintragen, diese werden im Prozess-Template angezeigt."]
["Zutrittskontrolle: Öffentlich zugängliche Netzzugänge im Verantwortungsbereich d. Einrichtung sind geschützt","H.I.R.N.-Port, verschlossener Raum","RUB-TOMs 3.1"]
["Zutrittskontrolle: Eigene aktive Netzkomponenten befinden sich in verschlossenen Schränken oder verschlossenen Räumen",null,"RUB-TOMs 3.1"]
["Zutrittskontrolle: Zugang zu eigenen aktiven Netzkomponenten ist auf berechtigte eingeschränkt und Berechtigung ist dokumentiert",null,"RUB-TOMs 3.1"]
["Zutrittskontrolle: Büroräume mit IT-Arbeitsplätzen sind gegen unberechtigten Zutritt gesichert",null,"RUB-TOMs 3.1"]
["Zutrittskontrolle: Organisationseigene Server stehen in einem zentralen Serverraum mit dem Risiko angemessener Schutzklasse",null,"RUB-TOMs 3.1"]
["Zutrittskontrolle: Organisationseigene Server stehen in einem vor unbefugten Zutritt gesicherten Standardraum","Sicherheitsschlösser, Manuelles Schließsystem, Elektronische Zutrittskontrolle (Chipkarte/Transponder), Biometrische Zutrittskontrolle, Schließsystem mit Codesperre, Einbruchsicherung von Fenstern, Einbruchsicherung von Schächten, Videoüberwachung der, Eingänge, Alarmanlage, Zutrittsprotokollierung","RUB-TOMs 3.1"]
["Zutrittskontrolle: Zutrittsberechtigungen zu organisationseigenen Servern werden restriktiv vergeben","nur an Administratoren","RUB-TOMs 3.1"]
["Zutrittskontrolle: Elektronische Verwaltung der Zutrittsberechtigung zu organisationseigenen Servern",null,"RUB-TOMs 3.1"]
["Zutrittskontrolle: Manuelle Verwaltung der Zutrittsberechtigung zu organisationseigenen Servern",null,"RUB-TOMs 3.1"]
["Zutrittskontrolle: Erteilung, Änderung und Entzug von Zutrittsberechtigungen zu organisationseigenen Servern erfolgt zeitnah",null,"RUB-TOMs 3.1"]
["Zutrittskontrolle: Dritte werden bei Zutritt zu organisationseigenen Servern von Beschäftigten begleitet","z.B. Wartungs-/Reinigungspersonal","RUB-TOMs 3.1"]
["Zugangskontrolle: Arbeitsplatzsysteme sind grundgesichert","Arbeitsplätze werden fachgerecht administriert \nAutomatische oder manuelle Bildschirmsperre durch Bildschirmschoner mit Passwort (bei kurzzeitigem Verlassen des Arbeitsplatzes)\nMalware-Schutz mit automatischer Aktualisierung \nRegelmäßige und zeitnahe Updates von Betriebssystem und Anwendersoftware\nRegelmäßige Backups der Datenbestände","RUB-TOMs 3.2"]
["Zugangskontrolle: Benutzervalidierung mittels Benutzername und Passwort",null,"RUB-TOMs 3.2"]
["Zugangskontrolle: Benutzervalidierung mittels Pin (mind. 6 Stellen)",null,"RUB-TOMs 3.2"]
["Zugangskontrolle: Benutzervalidierung mittels Zwei-Faktor-Verfahren",null,"RUB-TOMs 3.2"]
["Zugangskontrolle: Biometrische Benutzervalidierung",null,"RUB-TOMs 3.2"]
["Zugangskontrolle: Betrieb einer Desktop-Firewall",null,"RUB-TOMs 3.2"]
{"$rows_left_out":112}
{"sheet":"Risikoberechnung","index":6,"n_rows":24,"n_cols":12,"rows_kept":24,"merged":[[0,0,1,12],[3,0,4,0],[3,1,4,1],[3,2,3,5],[3,7,4,7],[3,8,4,8],[3,9,3,12],[4,2,4,3],[4,4,4,5],[4,9,4,10],[4,11,4,12],[5,2,5,3],[5,4,5,5],[5,9,5,10],[5,11,5,12],[6,2,6,3],[6,4,6,5],[6,9,6,10],[6,11,6,12],[7,2,7,3],[7,4,7,5],[7,9,7,10],[7,11,7,12],[8,2,8,3],[8,4,8,5],[8,9,8,10],[8,11,8,12],[10,0,10,5],[11,0,15,0],[16,2,16,5],[17,0,18,4],[21,0,21,1],[22,0,22,1],[23,0,23,1]]}
["Risikoberechnung"]
[]
[]
["Grad","Bezeichnung \ndes Grads","Eintrittswahrscheinlichkeit",{"$nulls":4},"Grad","Bezeichnung \ndes Grads","Schwere der Folgen / möglicher Schaden"]
[null,null,"Beschreibung",null,"Beispiel",{"$nulls":4},"Beschreibung",null,"Beispiel"]
[1,"geringfügig\n(<5%)","Schaden kann nach derzeitigem \nErwartungshorizont nicht eintreten.",null,"Ein wetterbedingter Datenverlust in einem deutschen Rechenzentrum kann erst bei Winden ab Hurricane-Stärke auftreten.",null,null,1,"geringfügig","Betroffene erleiden eventuell Unannehmlichkeiten, die sie aber mit einigen Problemen überwinden können.",null,"immateriell: leichte Verärgerung\nmateriell: Zeitverlust\nphysisch: vorübergehende Kopfschmerzen"]
[2,"überschaubar\n(5–25%)","Schaden kann zwar eintreten, aus bislang gemachten Erfahrungen bzw. aufgrund der gegebnen Umstände scheint der Eintritt aber unwahrscheinlich zu sein.",null,"Personenbezogene Daten befinden sich in einem Gebäude in welches regelmäßig eingebrochen wird. Die Daten sind allerdings für die breite Öffentlichkeit völlig uninteressant.",null,null,2,"überschaubar","Betroffene erleiden eventuell signifikante Unannehmlichkeiten, die sie aber mit einigen Schwierigkeiten überwinden können.",null,"immateriell: geringe, aber objektiv nachweisbare psychische Beschwerden\nmateriell: deutlich spürbarer Verlust an privatem Komfort\nphysisch: minderschwere körperliche Schäden (z.B. leichte Krankheit)"]
[3,"substanziell\n(26–75%)","Schadenseintritt scheint auf Basis bislang gemachter Erfahrungen bzw. aufgrund der gegebenen Umstände zwar möglich, aber nicht sehr wahrscheinlich zu sein.",null,"An einem PC-Arbeitsplatz, in einem gemeinschaftlich genutzten Büro, werden personenbezogene Daten verarbeitet. Der PC wird bei verlassen des Schreibtisches nicht gesperrt.",null,null,3,"substanziell","Betroffene erleiden eventuell signifikante Konsequenzen, die sie nur mit ernsthaften Schwierigkeiten überwinden können.",null,"immateriell: schwere psychische Beschwerden\nmateriell: finanzielle Schwierigkeiten\nphysisch: schwere körperliche Beschwerden"]
[4,"groß\n(>75%)","Schadenseintritt scheint auf Basis bislang gemachter Erfahrungen bzw. aufgrund der gegebenen Umstände möglich und sehr wahrscheinlich zu sein.",null,"Patientenakten liegen unbeaufsichtigt auf einem Wagen, im Flur eines Krankenhauses. Es kommen viele Angehörige an diesem Wagen vorbei und die Akten sind gut sichtbar mit Name und Geburtsdatum der Patient:innen beschriftet.",null,null,4,"groß","Betroffene erleiden eventuell signifikante oder sogar unumkehrbare Konsequenzen, die sie nicht überwinden können.",null,"immateriell: dauerhafte, schwere psychische Beschwerden\nmateriell: erhebliche Schulden\nphysisch: dauerhafte, schwere körperliche Beschwerden"]
[]
["Risikomatrix zur Berechnung der Risikokategorie nach Eintrittswahrscheinlichkeit und Schwere des Schadens"]
["Schwere des Schadens","groß","tragbares Risiko","tragbares Risiko","hohes Risiko","hohes Risiko"]
[null,"substanziell","tragbares Risiko","tragbares Risiko","tragbares Risiko","hohes Risiko"]
[null,"überschaubar","geringes Risiko","tragbares Risiko","tragbares Risiko","tragbares Risiko"]
[null,"geringfügig","geringes Risiko","geringes Risiko","tragbares Risiko","tragbares Risiko"]
[null,null,"geringfügig (<5%)","überschaubar (5–25%)","substanziell (26–75%)","groß (>75%)"]
[null,null,"Eintrittswahrscheinlichkeit"]
["vergl. S. 24 in: Der Bayerische Landesbeauftragte für den Datenschutz: Risikoanalyse und Datenschutz-Folgenabschätzung. Systematik, Anforderungen, Beispiele. 2022. Version 1.0"]
[]
["URL:","https://www.datenschutz-bayern.de/dsfa/OH_Risiko.pdf"]
{"$rows_left_out":5}
{"sheet":"Listen","index":7,"n_rows":15,"n_cols":7,"rows_kept":15,"hidden":true}
["Listen für die Arbeit mit dieser Excel-Datei"]
[]
["Risikoausprägungen","Status der DSFA","Gefährdungen","Betroffenes Gewährleistungsziel","Risikoquellen",null,"Notizen"]
["hohes Risiko","Entwurf","Unbefugte Offenbarung personenbezogener Daten","Vertraulichkeit,","interne menschliche Quellen"]
["tragbares Risiko","in Abstimmung mit der/dem Datenschutzbeauftragten","Unbefugte Offenbarung besonderer Kategorien personenbezogener Daten","Vertraulichkeit,","externe menschliche Quellen"]
["geringes Risiko","abgestimmt mit der/dem Datenschutzbeauftragten","Unbefugte Offenbarung besonderer Kategorien personenbezogener Daten mit Diskriminierungspotential","Vertraulichkeit,","nicht-menschliche Quellen"]
[null,"in Abstimmung mit Projektleitung","Unbefugte Veränderung personenbezogener Daten","Integrität,"]
[null,"abgestimmt mit Projektleitung","Unbefugte Veränderung besonderer Kategorien personenbezogener Daten","Integrität,"]
[null,"in Abstimmung mit Leitung der verantwortlichen Stelle","Unbefugte Veränderung besonderer Kategorien personenbezogener Daten mit Diskriminierungspotential","Integrität,"]
[null,"abgestimmt mit Leitung der verantwortlichen Stelle","Unerwartete Einschränkung der Datenverfügbarkeit","Verfügbarkeit,"]
[null,"in Abstimmung mit der zuständigen Datenschutzbehörde","Unerwarteter Datenverlust","Verfügbarkeit,"]
[null,"abgestimmt mit der zuständigen Datenschutzbehörde","Einschränkung des Auskunftsrechts","Transparenz,"]
[null,null,"Einschränkung des Berichtigungsrechts","Integrität,"]
[null,null,"Einschränkung des Einschränkungsrechts","Vertraulichkeit,"]
[null,null,"Einschränkung des Löschrechts (inkl. Widerruf und Widerspruch)","Vertraulichkeit,"]

{"sheet":"Prozess-Template","index":8,"n_rows":214,"n_cols":7,"rows_kept":214,"merged":[[0,0,1,1],[0,4,1,4],[3,3,3,4],[5,3,5,4],[6,2,9,2],[7,3,7,4],[8,3,9,3],[8,4,9,4],[10,0,10,4],[11,0,11,4],[12,0,12,4],[13,0,13,4],[14,0,14,4],[15,0,15,4],[16,0,16,4],[17,0,17,4],[18,0,18,4],[19,0,19,4],[20,0,20,4],[21,0,21,4],[22,0,22,2],[23,0,23,2],[24,0,24,2],[25,0,25,2],[26,0,26,2],[27,0,27,2],[28,0,28,2],[29,0,29,2],[30,0,30,2],[31,0,31,2],[32,0,32,2],[33,0,33,2],[34,0,34,2],[35,0,35,2],[36,0,36,2],[37,0,37,2],[38,0,38,2],[39,0,39,2],[40,0,40,2],[41,0,41,2],[42,0,42,2],[43,0,43,2],[44,0,44,2],[45,0,45,2],[46,0,46,2],[47,0,47,2],[48,0,48,2],[49,0,49,2],[50,0,50,2],[51,0,51,2],[52,0,52,2],[53,0,53,2],[54,0,54,2],[55,0,55,2],[56,0,56,2],[57,0,57,2],[58,0,58,2],[59,0,59,2],[60,0,60,2],[61,0,61,2],[62,0,62,2],[63,0,63,2],[64,0,64,2],[65,0,65,2],[66,0,66,2],[67,0,67,2],[68,0,68,2],[69,0,69,2],[70,0,70,2],[71,0,71,2],[72,0,72,2],[73,0,73,2],[74,0,74,2],[75,0,75,2],[76,0,76,2],[77,0,77,2],[78,0,78,2],[79,0,79,2],[80,0,80,2],[81,0,81,2],[82,0,82,2],[83,0,83,2],[84,0,84,2],[85,0,85,2],[86,0,86,2],[87,0,87,2],[88,0,88,2],[89,0,89,2],[90,0,90,2],[91,0,91,2],[92,0,92,2],[93,0,93,2],[94,0,94,2],[95,0,95,2],[96,0,96,2],[97,0,97,2],[98,0,98,2],[99,0,99,2]]}
[{"$f":" \"Risiko- und Schutzbedarfsanalyse für Prozess:\" & CHAR(10) & A6","v":"Risiko- und Schutzbedarfsanalyse für Prozess:\n"},null,"Version:",{"$f":"Metadaten!$B$4","v":0},"Farbcode:  Felder mit hellen Farbtönen sind ausfüllbar",{"$f":"HYPERLINK(\"#Übersicht!$A$1\", \"Link zur Übersicht\")","v":"Link zur Übersicht"},{"$f":"_xlfn.CONCAT(\"\")","v":""}]
[null,null,"vom:",{"$f":"Metadaten!$B$5","v":"00:00:00"}]
[{"$f":"IF(ISTEXT(Strukturkategorie), HYPERLINK(\"#Projektstruktur!$A$2\", Strukturkategorie),\"\")","v":""},"Betroffene Gewährleistungsziele","Risikoquelle/Angreifer","Bewertung vor Anwendung der Maßnahmen","Bewertung nach Anwendung der Maßnahmen"]
[null,{"$f":"IF(NOT(ISERROR(FIND(\"Vertraulichkeit\",_xlfn.CONCAT(IF(ISTEXT('Prozess-Template'!A8),VLOOKUP('Prozess-Template'!A8,dbRisikenZiele,2,FALSE),\"\"),IF(ISTEXT('Prozess-Template'!A9),VLOOKUP('Prozess-Template'!A9,dbRisikenZiele,2,FALSE),\"\"),IF(ISTEXT('Prozess-Template'!A10),VLOOKUP('Prozess-Template'!A10,dbRisikenZiele,2,FALSE),\"\"))))),\"Vertraulichkeit\",\"- \")","v":"- "},null,"Eintrittswahrscheinlichkeit","Eintrittswahrscheinlichkeit"]
["Prozessschritt",{"$f":"IF(NOT(ISERROR(FIND(\"Integrität\",_xlfn.CONCAT(IF(ISTEXT('Prozess-Template'!A8),VLOOKUP('Prozess-Template'!A8,dbRisikenZiele,2,FALSE),\"\"),IF(ISTEXT('Prozess-Template'!A9),VLOOKUP('Prozess-Template'!A9,dbRisikenZiele,2,FALSE),\"\"),IF(ISTEXT('Prozess-Template'!A10),VLOOKUP('Prozess-Template'!A10,dbRisikenZiele,2,FALSE),\"\"))))),\"Integrität\",\"- \")","v":"- "}]
[null,{"$f":"IF(NOT(ISERROR(FIND(\"Verfügbarkeit\",_xlfn.CONCAT(IF(ISTEXT('Prozess-Template'!A8),VLOOKUP('Prozess-Template'!A8,dbRisikenZiele,2,FALSE),\"\"),IF(ISTEXT('Prozess-Template'!A9),VLOOKUP('Prozess-Template'!A9,dbRisikenZiele,2,FALSE),\"\"),IF(ISTEXT('Prozess-Template'!A10),VLOOKUP('Prozess-Template'!A10,dbRisikenZiele,2,FALSE),\"\"))))),\"Verfügbarkeit\",\"- \")","v":"- "},null,"Schweregrad","Schweregrad"]
["Gefährdungen",{"$f":"IF(NOT(ISERROR(FIND(\"Datenminimierung\",_xlfn.CONCAT(IF(ISTEXT('Prozess-Template'!A8),VLOOKUP('Prozess-Template'!A8,dbRisikenZiele,2,FALSE),\"\"),IF(ISTEXT('Prozess-Template'!A9),VLOOKUP('Prozess-Template'!A9,dbRisikenZiele,2,FALSE),\"\"),IF(ISTEXT('Prozess-Template'!A10),VLOOKUP('Prozess-Template'!A10,dbRisikenZiele,2,FALSE),\"\"))))),\"Datenminimierung\",\"- \")","v":"- "}]
[null,{"$f":"IF(NOT(ISERROR(FIND(\"Transparenz\",_xlfn.CONCAT(IF(ISTEXT('Prozess-Template'!A8),VLOOKUP('Prozess-Template'!A8,dbRisikenZiele,2,FALSE),\"\"),IF(ISTEXT('Prozess-Template'!A9),VLOOKUP('Prozess-Template'!A9,dbRisikenZiele,2,FALSE),\"\"),IF(ISTEXT('Prozess-Template'!A10),VLOOKUP('Prozess-Template'!A10,dbRisikenZiele,2,FALSE),\"\"))))),\"Transparenz\",\"- \")","v":"- "},null,{"$f":"HYPERLINK(\"#Risikoberechnung!$A$1\", \"Risikokategorie\")","v":"Risikokategorie"},"Risikokategorie"]
[null,{"$f":"IF(NOT(ISERROR(FIND(\"Intervenierbarkeit\",_xlfn.CONCAT(IF(ISTEXT('Prozess-Template'!A8),VLOOKUP('Prozess-Template'!A8,dbRisikenZiele,2,FALSE),\"\"),IF(ISTEXT('Prozess-Template'!A9),VLOOKUP('Prozess-Template'!A9,dbRisikenZiele,2,FALSE),\"\"),IF(ISTEXT('Prozess-Template'!A10),VLOOKUP('Prozess-Template'!A10,dbRisikenZiele,2,FALSE),\"\"))))),\"Intervenierbarkeit\",\"- \")","v":"- "},null,{"$f":"IF(AND(ISTEXT(D5),ISTEXT(D7)),INDEX(Risikomatrix,MATCH(D7,RisikoDimSchwere,0),MATCH(D5,RisikoDimProb,0)),\" ------- \")","v":" ------- "},{"$f":"IF(AND(ISTEXT(E5),ISTEXT(E7)),INDEX(Risikomatrix,MATCH(E7,RisikoDimSchwere,0),MATCH(E5,RisikoDimProb,0)),\" ------- \")","v":" ------- "}]
[null,{"$f":"IF(NOT(ISERROR(FIND(\"Nichtverkettung\",_xlfn.CONCAT(IF(ISTEXT('Prozess-Template'!A8),VLOOKUP('Prozess-Template'!A8,dbRisikenZiele,2,FALSE),\"\"),IF(ISTEXT('Prozess-Template'!A9),VLOOKUP('Prozess-Template'!A9,dbRisikenZiele,2,FALSE),\"\"),IF(ISTEXT('Prozess-Template'!A10),VLOOKUP('Prozess-Template'!A10,dbRisikenZiele,2,FALSE),\"\"))))),\"Nichtverkettung\",\"- \")","v":"- "}]
[{"$f":"HYPERLINK(\"#Risiken!$A$2\", \"Beschreibung beispielhafter Risiken, die an diesem Prozessschritt eintreten können (abhängig von den ausgewählten Gefährdungen und Risikoquellen):\")","v":"Beschreibung beispielhafter Risiken, die an diesem Prozessschritt eintreten können (abhängig von den ausgewählten Gefährdungen und Risikoquellen):"}]
{"$rows_empty":10}
[{"$f":"HYPERLINK(\"#Maßnahmen!$A$2\",\"Maßnahmen\")","v":"Maßnahmen"}]
["Bezeichnung",null,null,"Beschreibung","ext. Referenz/ID"]
[{"$nulls":3},{"$f":"IF(ISTEXT(A24), HYPERLINK(\"#\" & ADDRESS(MATCH(A24,Maßnahmen!$A:$A,0),2,,,\"Maßnahmen\"), \"zur Beschreibung\"),\"\")","v":""},{"$f":"IF(AND(ISTEXT(A24),NOT(ISBLANK(VLOOKUP(A24,dbTOMS,3,FALSE)))),VLOOKUP(A24,dbTOMS,3,FALSE),\"\")","v":""}]
[{"$nulls":3},{"$f":"IF(ISTEXT(A25), HYPERLINK(\"#\" & ADDRESS(MATCH(A25,Maßnahmen!$A:$A,0),2,,,\"Maßnahmen\"), \"zur Beschreibung\"),\"\")","v":""},""]
[{"$nulls":3},{"$f":"IF(ISTEXT(A26), HYPERLINK(\"#\" & ADDRESS(MATCH(A26,Maßnahmen!$A:$A,0),2,,,\"Maßnahmen\"), \"zur Beschreibung\"),\"\")","v":""},""]
[{"$nulls":3},{"$f":"IF(ISTEXT(A27), HYPERLINK(\"#\" & ADDRESS(MATCH(A27,Maßnahmen!$A:$A,0),2,,,\"Maßnahmen\"), \"zur Beschreibung\"),\"\")","v":""},""]
[{"$nulls":3},{"$f":"IF(ISTEXT(A28), HYPERLINK(\"#\" & ADDRESS(MATCH(A28,Maßnahmen!$A:$A,0),2,,,\"Maßnahmen\"), \"zur Beschreibung\"),\"\")","v":""},""]
[{"$nulls":3},{"$f":"IF(ISTEXT(A29), HYPERLINK(\"#\" & ADDRESS(MATCH(A29,Maßnahmen!$A:$A,0),2,,,\"Maßnahmen\"), \"zur Beschreibung\"),\"\")","v":""},""]
{"$rows_left_out":174}